Reaction Details
TargetNeuropilin-1
LigandBDBM46608
Substrate/Competitorn/a
IC50>95000±n/a nM
Citation PubChem, PC Dose Response confirmation of small molecule modulators of the interaction between CendR and NRP-1 in a panel assay PubChem Bioassay(2012)[AID]
 
Neuropilin-1
Name:Neuropilin-1
Type:PROTEIN
Mol. Mass.:103122.09
Organism:Homo sapiens (Human)
Description:ChEMBL_617636
Residue:923
BDBM46608
NameBDBM46608
Synonyms:(4E)-5-methyl-4-[(3-nitroanilino)methylene]-2-phenyl-2-pyrazoline-3-thione (4E)-5-methyl-4-[(3-nitroanilino)methylidene]-2-phenylpyrazole-3-thione (4Z)-5-methyl-4-[(3-nitroanilino)methylene]-2-phenyl-2-pyrazoline-3-thione cid_6945186
TypeSmall organic molecule
Emp. Form.C17H14N4O2S
Mol. Mass.338.384
SMILESCc1[n-]n(-c2ccccc2)c(=S)c1\C=[NH+]\c1cccc(c1)[N+]([O-])=O