Reaction Details
TargetPerilipin-1
LigandBDBM94544
Substrate/Competitorn/a
IC50 1877±n/a nM
Citation PubChem, PC Counterscreen for inhibitors of the interaction of the lipase co-activator protein, abhydrolase domain containing 5 (ABHD5) with perilipin-5 (MLDP; PLIN5) PubChem Bioassay(2012)[AID]
 
Perilipin-1
Name:Perilipin-1
Type:Enzyme Catalytic Domain
Mol. Mass.:55988.69
Organism:Homo sapiens (Human)
Description:gi_223718203
Residue:522
BDBM94544
NameBDBM94544
Synonyms:MLS003674204 N-cyclohexyl-2-[3-(2-furyl)-2-keto-quinoxalin-1-yl]-2-(4-phenylphenyl)acetamide N-cyclohexyl-2-[3-(furan-2-yl)-2-oxoquinoxalin-1-yl]-2-(4-phenylphenyl)acetamide cid_53383329
TypeSmall organic molecule
Emp. Form.C32H29N3O3
Mol. Mass.503.591
SMILESO=C(NC1CCCCC1)C(c1ccc(cc1)-c1ccccc1)n1c2ccccc2nc(-c2ccco2)c1=O