Reaction Details
TargetPerilipin-1
LigandBDBM94608
Substrate/Competitorn/a
IC50 1368±n/a nM
Citation PubChem, PC Counterscreen for inhibitors of the interaction of the lipase co-activator protein, abhydrolase domain containing 5 (ABHD5) with perilipin-5 (MLDP; PLIN5) PubChem Bioassay(2012)[AID]
 
Perilipin-1
Name:Perilipin-1
Type:Enzyme Catalytic Domain
Mol. Mass.:55988.69
Organism:Homo sapiens (Human)
Description:gi_223718203
Residue:522
BDBM94608
NameBDBM94608
Synonyms:2-heptylidene-5-(1-pyrrolidinylmethyl)-1-cyclopentanone;hydrochloride 2-heptylidene-5-(pyrrolidinomethyl)cyclopentanone;hydrochloride MLS003389211 cid_368778
TypeSmall organic molecule
Emp. Form.C17H29NO
Mol. Mass.263.4183
SMILESCCCCCCC=C1CCC(CN2CCCC2)C1=O