Reaction Details
TargetPerilipin-1
LigandBDBM83461
Substrate/Competitorn/a
IC50 1177±n/a nM
Citation PubChem, PC Counterscreen for inhibitors of the interaction of the lipase co-activator protein, abhydrolase domain containing 5 (ABHD5) with perilipin-5 (MLDP; PLIN5) PubChem Bioassay(2012)[AID]
 
Perilipin-1
Name:Perilipin-1
Type:Enzyme Catalytic Domain
Mol. Mass.:55988.69
Organism:Homo sapiens (Human)
Description:gi_223718203
Residue:522
BDBM83461
NameBDBM83461
Synonyms:(phenylmethyl) N,N-dimethyl-N'-(C-methylsulfanyl-N-phenyl-carbonimidoyl)carbamimidothioate;hydroiodide MLS002701781 SMR001565375 cid_360443
TypeSmall organic molecule
Emp. Form.C18H21N3S2
Mol. Mass.343.509
SMILESCS\C(N=C(SCc1ccccc1)N(C)C)=N/c1ccccc1