Reaction Details
TargetLow molecular weight phosphotyrosine protein phosphatase
LigandBDBM94905
Substrate/Competitorn/a
IC50 2890±n/a nM
Citation PubChem, PC Dose response confirmation of small molecule inhibitors of Low Molecular Weight Protein Tyrosine Phosphatase, LMPTP, via a fluorescence intensity assay PubChem Bioassay(2012)[AID]
 
Low molecular weight phosphotyrosine protein phosphatase
Name:Low molecular weight phosphotyrosine protein phosphatase
Type:n/a
Mol. Mass.:18042.81
Organism:Homo sapiens (Human)
Description:P24666
Residue:158
BDBM94905
NameBDBM94905
Synonyms:1-cyclopropyl-7-[4-(2,3-dihydro-1,4-benzodioxin-6-ylsulfonyl)-1-piperazinyl]-6-fluoro-4-oxo-3-quinolinecarboxylic acid 1-cyclopropyl-7-[4-(2,3-dihydro-1,4-benzodioxin-6-ylsulfonyl)piperazin-1-yl]-6-fluoro-4-oxoquinoline-3-carboxylic acid MLS000776640 cid_2106919
TypeSmall organic molecule
Emp. Form.C25H24FN3O7S
Mol. Mass.529.537
SMILESOC(=O)c1cn(C2CC2)c2cc(N3CCN(CC3)S(=O)(=O)c3ccc4OCCOc4c3)c(F)cc2c1=O