Reaction Details
TargetProbable nicotinate-nucleotide adenylyltransferase
LigandBDBM51295
Substrate/Competitorn/a
IC50 17000±n/a nM
Citation PubChem, PC Dose response confirmation of uHTS inhibitor hits from NadD in a Colorimetric assay - Set 2 PubChem Bioassay(2012)[AID]
 
Probable nicotinate-nucleotide adenylyltransferase
Name:Probable nicotinate-nucleotide adenylyltransferase
Type:Enzyme Catalytic Domain
Mol. Mass.:22100.53
Organism:Staphylococcus aureus subsp. aureus N315
Description:gi_15927174
Residue:189
BDBM51295
NameBDBM51295
Synonyms:8-Amino-2-thioxo-2,3-dihydro-1H-benzo[g]pteridin-4-one 8-amino-2-thioxo-1H-benzo[g]pteridin-4-one MLS000776691 cid_5417965
TypeSmall organic molecule
Emp. Form.C10H7N5OS
Mol. Mass.245.26
SMILESNc1ccc2nc3c(nc2c1)[nH]c(=S)[nH]c3=O