Reaction Details
TargetHepatocyte nuclear factor 4-alpha
LigandBDBM14672
Substrate/Competitorn/a
IC50>39869±n/a nM
Citation PubChem, PC Counterscreen for inhibitors of the interaction of the lipase co-activator protein, abhydrolase domain containing 5 (ABHD5) with perilipin-5 (MLDP; PLIN5): Luminescence-based biochemical high throughput dose response assay to identify inhibitors of Hepatocyte nuclear factor 4 (HNF4) dimerization PubChem Bioassay(2012)[AID]
 
Hepatocyte nuclear factor 4-alpha
Name:Hepatocyte nuclear factor 4-alpha
Type:PROTEIN
Mol. Mass.:52790.24
Organism:Homo sapiens (Human)
Description:ChEMBL_606516
Residue:474
BDBM14672
NameBDBM14672
Synonyms:2-hydroxypropane-1,2,3-tricarboxylic acid Citrate Fragment 2 | cid_311
TypeSmall organic molecule
Emp. Form.C6H8O7
Mol. Mass.192.1235
SMILESOC(=O)CC(O)(CC(O)=O)C(O)=O