Reaction Details
TargetHepatocyte nuclear factor 4-alpha
LigandBDBM43474
Substrate/Competitorn/a
IC50 12884±n/a nM
Citation PubChem, PC Counterscreen for inhibitors of the interaction of the lipase co-activator protein, abhydrolase domain containing 5 (ABHD5) with perilipin-5 (MLDP; PLIN5): Luminescence-based biochemical high throughput dose response assay to identify inhibitors of Hepatocyte nuclear factor 4 (HNF4) dimerization PubChem Bioassay(2012)[AID]
 
Hepatocyte nuclear factor 4-alpha
Name:Hepatocyte nuclear factor 4-alpha
Type:PROTEIN
Mol. Mass.:52790.24
Organism:Homo sapiens (Human)
Description:ChEMBL_606516
Residue:474
BDBM43474
NameBDBM43474
Synonyms:(3Z,5E)-1-ethyl-3,5-bis(3-hydroxy-4-methoxy-benzylidene)-4-piperidone (3Z,5E)-1-ethyl-3,5-bis[(3-hydroxy-4-methoxyphenyl)methylidene]piperidin-4-one MLS000775870 cid_2376815
TypeSmall organic molecule
Emp. Form.C23H25NO5
Mol. Mass.395.4483
SMILESCCN1C\C(=C\c2ccc(OC)c(O)c2)C(=O)\C(C1)=C\c1ccc(OC)c(O)c1