Reaction Details
TargetHepatocyte nuclear factor 4-alpha
LigandBDBM37636
Substrate/Competitorn/a
IC50>39841±n/a nM
Citation PubChem, PC Counterscreen for inhibitors of the interaction of the lipase co-activator protein, abhydrolase domain containing 5 (ABHD5) with perilipin-5 (MLDP; PLIN5): Luminescence-based biochemical high throughput dose response assay to identify inhibitors of Hepatocyte nuclear factor 4 (HNF4) dimerization PubChem Bioassay(2012)[AID]
 
Hepatocyte nuclear factor 4-alpha
Name:Hepatocyte nuclear factor 4-alpha
Type:PROTEIN
Mol. Mass.:52790.24
Organism:Homo sapiens (Human)
Description:ChEMBL_606516
Residue:474
BDBM37636
NameBDBM37636
Synonyms:ALVERINE CITRATE SALT N-ethyl-3-phenyl-N-(3-phenylpropyl)-1-propanamine;2-hydroxypropane-1,2,3-tricarboxylic acid N-ethyl-3-phenyl-N-(3-phenylpropyl)propan-1-amine;2-oxidanylpropane-1,2,3-tricarboxylic acid alverine citric acid;ethyl-bis(3-phenylpropyl)amine
TypeSmall organic molecule
Emp. Form.C20H27N
Mol. Mass.281.4351
SMILESCCN(CCCc1ccccc1)CCCc1ccccc1