Reaction Details
TargetEnvelope glycoprotein gp160
LigandBDBM95309
Substrate/Competitorn/a
IC50 2873±n/a nM
Citation PubChem, PC TRFRET-based biochemical high throughput dose response assay for small molecules that bind to the HIV-1-gp120 binding antibody, PG9 PubChem Bioassay(2012)[AID]
 
Envelope glycoprotein gp160
Name:Envelope glycoprotein gp160
Type:n/a
Mol. Mass.:97241.93
Organism:Human immunodeficiency virus type 1 group M subtype B (isolate HXB2)
Description:n/a
Residue:856
BDBM95309
NameBDBM95309
Synonyms:5-(1,3-benzodioxol-5-yl)-2-(4-methoxyphenyl)-1-methyl-3-(phenylthio)indole 5-(1,3-benzodioxol-5-yl)-2-(4-methoxyphenyl)-1-methyl-3-phenylsulfanylindole SMR002252916 | cid_53301435
TypeSmall organic molecule
Emp. Form.C29H23NO3S
Mol. Mass.465.563
SMILESCOc1ccc(cc1)-c1c(Sc2ccccc2)c2cc(ccc2n1C)-c1ccc2OCOc2c1