Reaction Details
TargetEnvelope glycoprotein gp160
LigandBDBM95256
Substrate/Competitorn/a
IC50 2358±n/a nM
Citation PubChem, PC Counterscreen for discovery of small molecules that bind to the HIV-1-gp120 binding antibody, PG9 PubChem Bioassay(2012)[AID]
 
Envelope glycoprotein gp160
Name:Envelope glycoprotein gp160
Type:n/a
Mol. Mass.:97241.93
Organism:Human immunodeficiency virus type 1 group M subtype B (isolate HXB2)
Description:n/a
Residue:856
BDBM95256
NameBDBM95256
Synonyms:2-(2-Methyl-benzo[4,5]furo[3,2-d]pyrimidin-4-ylsulfanyl)-N-phenethyl-acetamide 2-[(2-methyl-[1]benzofuro[3,2-d]pyrimidin-4-yl)sulfanyl]-N-(2-phenylethyl)acetamide 2-[(2-methylbenzofuro[3,2-d]pyrimidin-4-yl)thio]-N-phenethyl-acetamide SMR000148870 | cid_2014844
TypeSmall organic molecule
Emp. Form.C21H19N3O2S
Mol. Mass.377.459
SMILESCc1nc(SCC(=O)NCCc2ccccc2)c2oc3ccccc3c2n1