Reaction Details
TargetEnvelope glycoprotein gp160
LigandBDBM54959
Substrate/Competitorn/a
IC50>67054±n/a nM
Citation PubChem, PC Counterscreen for discovery of small molecules that bind to the HIV-1-gp120 binding antibody, PG9 PubChem Bioassay(2012)[AID]
 
Envelope glycoprotein gp160
Name:Envelope glycoprotein gp160
Type:n/a
Mol. Mass.:97241.93
Organism:Human immunodeficiency virus type 1 group M subtype B (isolate HXB2)
Description:n/a
Residue:856
BDBM54959
NameBDBM54959
Synonyms:3-(2-furyl)-6-m-phenetyl-[1,2,4]triazolo[3,4-b][1,3,4]thiadiazole 6-(3-ethoxyphenyl)-3-(furan-2-yl)-[1,2,4]triazolo[3,4-b][1,3,4]thiadiazole cid_662842
TypeSmall organic molecule
Emp. Form.C15H12N4O2S
Mol. Mass.312.346
SMILESCCOc1cccc(c1)-c1nn2c(nnc2s1)-c1ccco1