Reaction Details
TargetEnvelope glycoprotein gp160
LigandBDBM95248
Substrate/Competitorn/a
IC50 3913±n/a nM
Citation PubChem, PC Counterscreen for discovery of small molecules that bind to the HIV-1-gp120 binding antibody, PG9 PubChem Bioassay(2012)[AID]
 
Envelope glycoprotein gp160
Name:Envelope glycoprotein gp160
Type:n/a
Mol. Mass.:97241.93
Organism:Human immunodeficiency virus type 1 group M subtype B (isolate HXB2)
Description:n/a
Residue:856
BDBM95248
NameBDBM95248
Synonyms:4-acetyl-N-(2,5-diethoxyphenyl)-3,5-dimethyl-1H-pyrrole-2-carboxamide N-(2,5-diethoxyphenyl)-4-ethanoyl-3,5-dimethyl-1H-pyrrole-2-carboxamide cid_3236746
TypeSmall organic molecule
Emp. Form.C19H24N2O4
Mol. Mass.344.4049
SMILESCCOc1ccc(OCC)c(NC(=O)c2[nH]c(C)c(C(C)=O)c2C)c1