Reaction Details
TargetEnvelope glycoprotein gp160
LigandBDBM95254
Substrate/Competitorn/a
IC50 4334±n/a nM
Citation PubChem, PC Counterscreen for discovery of small molecules that bind to the HIV-1-gp120 binding antibody, PG9 PubChem Bioassay(2012)[AID]
 
Envelope glycoprotein gp160
Name:Envelope glycoprotein gp160
Type:n/a
Mol. Mass.:97241.93
Organism:Human immunodeficiency virus type 1 group M subtype B (isolate HXB2)
Description:n/a
Residue:856
BDBM95254
NameBDBM95254
Synonyms:1-(2,1,3-benzothiadiazol-4-ylsulfonyl)-N-(3-methylphenyl)-3-piperidinecarboxamide MLS000521829 SMR000132237 | cid_9551239
TypeSmall organic molecule
Emp. Form.C19H20N4O3S2
Mol. Mass.416.517
SMILESCc1cccc(NC(=O)C2CCCN(C2)S(=O)(=O)c2cccc3nsnc23)c1