Reaction Details
TargetEnvelope glycoprotein gp160
LigandBDBM95260
Substrate/Competitorn/a
IC50 17172±n/a nM
Citation PubChem, PC Counterscreen for discovery of small molecules that bind to the HIV-1-gp120 binding antibody, PG9 PubChem Bioassay(2012)[AID]
 
Envelope glycoprotein gp160
Name:Envelope glycoprotein gp160
Type:n/a
Mol. Mass.:97241.93
Organism:Human immunodeficiency virus type 1 group M subtype B (isolate HXB2)
Description:n/a
Residue:856
BDBM95260
NameBDBM95260
Synonyms:MLS000537583 N-(5-benzoyl-4-phenyl-thiazol-2-yl)carbamic acid methyl ester cid_851892 methyl N-(5-benzoyl-4-phenyl-1,3-thiazol-2-yl)carbamate | methyl N-[4-phenyl-5-(phenylcarbonyl)-1,3-thiazol-2-yl]carbamate
TypeSmall organic molecule
Emp. Form.C18H14N2O3S
Mol. Mass.338.38
SMILESCOC(=O)Nc1nc(c(s1)C(=O)c1ccccc1)-c1ccccc1