Reaction Details
TargetEnvelope glycoprotein gp160
LigandBDBM66169
Substrate/Competitorn/a
IC50 28574±n/a nM
Citation PubChem, PC Counterscreen for discovery of small molecules that bind to the HIV-1-gp120 binding antibody, PG9 PubChem Bioassay(2012)[AID]
 
Envelope glycoprotein gp160
Name:Envelope glycoprotein gp160
Type:n/a
Mol. Mass.:97241.93
Organism:Human immunodeficiency virus type 1 group M subtype B (isolate HXB2)
Description:n/a
Residue:856
BDBM66169
NameBDBM66169
Synonyms:3-phenyl-2-sulfanylidene-1H-[1]benzofuro[3,2-d]pyrimidin-4-one 3-phenyl-2-thioxo-1H-benzofuro[3,2-d]pyrimidin-4-one SMR000236819 | cid_2150404
TypeSmall organic molecule
Emp. Form.C16H10N2O2S
Mol. Mass.294.328
SMILESO=c1n(-c2ccccc2)c(=S)[nH]c2c3ccccc3oc12