Reaction Details
TargetEnvelope glycoprotein gp160
LigandBDBM95276
Substrate/Competitorn/a
IC50 13524±n/a nM
Citation PubChem, PC Counterscreen for discovery of small molecules that bind to the HIV-1-gp120 binding antibody, PG9 PubChem Bioassay(2012)[AID]
 
Envelope glycoprotein gp160
Name:Envelope glycoprotein gp160
Type:n/a
Mol. Mass.:97241.93
Organism:Human immunodeficiency virus type 1 group M subtype B (isolate HXB2)
Description:n/a
Residue:856
BDBM95276
NameBDBM95276
Synonyms:6-[1-oxo-2-[4-(1-oxopropyl)phenoxy]ethyl]-4H-1,4-benzoxazin-3-one 6-[2-(4-propanoylphenoxy)ethanoyl]-4H-1,4-benzoxazin-3-one MLS000771362 cid_2515869
TypeSmall organic molecule
Emp. Form.C19H17NO5
Mol. Mass.339.342
SMILESCCC(=O)c1ccc(OCC(=O)c2ccc3OCC(=O)Nc3c2)cc1