Reaction Details
TargetEnvelope glycoprotein gp160
LigandBDBM95292
Substrate/Competitorn/a
IC50 20519±n/a nM
Citation PubChem, PC Counterscreen for discovery of small molecules that bind to the HIV-1-gp120 binding antibody, PG9 PubChem Bioassay(2012)[AID]
 
Envelope glycoprotein gp160
Name:Envelope glycoprotein gp160
Type:n/a
Mol. Mass.:97241.93
Organism:Human immunodeficiency virus type 1 group M subtype B (isolate HXB2)
Description:n/a
Residue:856
BDBM95292
NameBDBM95292
Synonyms:5-(4-bromophenyl)-1-methyl-2,4-dioxo-7-pyrido[2,3-d]pyrimidinecarboxylic acid methyl ester MLS001198876 cid_23604867 methyl 5-(4-bromophenyl)-1-methyl-2,4-dioxo-1,2,3,4-tetrahydropyrido[2,3-d]pyrimidine-7-carboxylate | methyl 5-(4-bromophenyl)-1-methyl-2,4-dioxopyrido[2,3-d]pyrimidine-7-carboxylate
TypeSmall organic molecule
Emp. Form.C16H12BrN3O4
Mol. Mass.390.188
SMILESCOC(=O)c1cc(-c2ccc(Br)cc2)c2c(n1)n(C)c(=O)[nH]c2=O