Reaction Details
TargetMitochondrial peptide methionine sulfoxide reductase
LigandBDBM95316
Substrate/Competitorn/a
IC50 115036±n/a nM
Citation PubChem, PC Absorbance-based biochemical high throughput dose response assay to identify inhibitors of Methionine sulfoxide reductase A (MsrA) PubChem Bioassay(2013)[AID]
 
Mitochondrial peptide methionine sulfoxide reductase
Name:Mitochondrial peptide methionine sulfoxide reductase
Type:Enzyme Catalytic Domain
Mol. Mass.:25822.90
Organism:Bos taurus
Description:gi_73586699
Residue:233
BDBM95316
NameBDBM95316
Synonyms:2-(4-keto-6-methyl-2-thioxo-1H-pyrimidin-5-yl)propionic acid amyl ester MLS000081534 cid_662298 pentyl 2-(6-methyl-4-oxo-2-sulfanylidene-1H-pyrimidin-5-yl)propanoate
TypeSmall organic molecule
Emp. Form.C13H20N2O3S
Mol. Mass.284.374
SMILESCCCCCOC(=O)C(C)c1c(C)[nH]c(=S)[nH]c1=O