Reaction Details
TargetMitochondrial peptide methionine sulfoxide reductase
LigandBDBM95391
Substrate/Competitorn/a
IC50 122003±n/a nM
Citation PubChem, PC Absorbance-based biochemical high throughput dose response assay to identify inhibitors of Methionine sulfoxide reductase A (MsrA) PubChem Bioassay(2013)[AID]
 
Mitochondrial peptide methionine sulfoxide reductase
Name:Mitochondrial peptide methionine sulfoxide reductase
Type:Enzyme Catalytic Domain
Mol. Mass.:25822.90
Organism:Bos taurus
Description:gi_73586699
Residue:233
BDBM95391
NameBDBM95391
Synonyms:2-chloro-5-(5-{[(3,5-dioxo-4-azatetracyclo[5.3.2.0~2,6~.0~8,10~]dodec-11-en-4-yl)imino]methyl}-2-furyl)benzoic acid SMR000298460 | cid_9554526
TypeSmall organic molecule
Emp. Form.C23H17ClN2O5
Mol. Mass.436.844
SMILES[H]C12C=CC([H])(C3CC13)C1C2C(=O)N(\N=C\c2ccc(o2)-c2ccc(Cl)c(c2)C(O)=O)C1=O