Reaction Details
TargetMitochondrial peptide methionine sulfoxide reductase
LigandBDBM47968
Substrate/Competitorn/a
IC50 14265±n/a nM
Citation PubChem, PC Absorbance-based biochemical high throughput dose response assay to identify inhibitors of Methionine sulfoxide reductase A (MsrA) PubChem Bioassay(2013)[AID]
 
Mitochondrial peptide methionine sulfoxide reductase
Name:Mitochondrial peptide methionine sulfoxide reductase
Type:Enzyme Catalytic Domain
Mol. Mass.:25822.90
Organism:Bos taurus
Description:gi_73586699
Residue:233
BDBM47968
NameBDBM47968
Synonyms:MLS000686315 N-[4-[(1-oxidanylidene-4-thiophen-2-ylsulfonylimino-naphthalen-2-yl)amino]phenyl]ethanamide N-[4-[(1-oxo-4-thiophen-2-ylsulfonyliminonaphthalen-2-yl)amino]phenyl]acetamide N-[4-[[1-keto-4-(2-thienylsulfonylimino)-2-naphthyl]amino]phenyl]acetamide cid_3715121
TypeSmall organic molecule
Emp. Form.C22H17N3O4S2
Mol. Mass.451.518
SMILESCC(=O)Nc1ccc(NC2=CC(=NS(=O)(=O)c3cccs3)c3ccccc3C2=O)cc1