Reaction Details
TargetMitochondrial peptide methionine sulfoxide reductase
LigandBDBM58032
Substrate/Competitorn/a
IC50 12118±n/a nM
Citation PubChem, PC Absorbance-based biochemical high throughput dose response assay to identify inhibitors of Methionine sulfoxide reductase A (MsrA) PubChem Bioassay(2013)[AID]
 
Mitochondrial peptide methionine sulfoxide reductase
Name:Mitochondrial peptide methionine sulfoxide reductase
Type:Enzyme Catalytic Domain
Mol. Mass.:25822.90
Organism:Bos taurus
Description:gi_73586699
Residue:233
BDBM58032
NameBDBM58032
Synonyms:2-(1,3-Dioxo-indan-2-yl)-2-(2-methyl-1H-indol-3-yl)-malononitrile 2-(1,3-dioxo-2-indenyl)-2-(2-methyl-1H-indol-3-yl)propanedinitrile 2-[1,3-bis(oxidanylidene)inden-2-yl]-2-(2-methyl-1H-indol-3-yl)propanedinitrile SMR000416004 cid_582632
TypeSmall organic molecule
Emp. Form.C21H13N3O2
Mol. Mass.339.3468
SMILESCc1[nH]c2ccccc2c1C(C#N)(C#N)C1C(=O)c2ccccc2C1=O