Reaction Details
TargetMitochondrial peptide methionine sulfoxide reductase
LigandBDBM93697
Substrate/Competitorn/a
IC50 76751±n/a nM
Citation PubChem, PC Absorbance-based biochemical high throughput dose response assay to identify inhibitors of Methionine sulfoxide reductase A (MsrA) PubChem Bioassay(2013)[AID]
 
Mitochondrial peptide methionine sulfoxide reductase
Name:Mitochondrial peptide methionine sulfoxide reductase
Type:Enzyme Catalytic Domain
Mol. Mass.:25822.90
Organism:Bos taurus
Description:gi_73586699
Residue:233
BDBM93697
NameBDBM93697
Synonyms:MLS001181286 cid_3897207
TypeSmall organic molecule
Emp. Form.C18H12N4O6
Mol. Mass.380.3111
SMILESCC(=O)Nn1c(=O)c2ccc3c4c(ccc(c24)c1=O)c(=O)n(NC(C)=O)c3=O