Reaction Details
TargetMitochondrial peptide methionine sulfoxide reductase
LigandBDBM48027
Substrate/Competitorn/a
IC50 44773±n/a nM
Citation PubChem, PC Absorbance-based biochemical high throughput dose response assay to identify inhibitors of Methionine sulfoxide reductase A (MsrA) PubChem Bioassay(2013)[AID]
 
Mitochondrial peptide methionine sulfoxide reductase
Name:Mitochondrial peptide methionine sulfoxide reductase
Type:Enzyme Catalytic Domain
Mol. Mass.:25822.90
Organism:Bos taurus
Description:gi_73586699
Residue:233
BDBM48027
NameBDBM48027
Synonyms:4-[[(4E)-1-keto-4-mesitylsulfonylimino-2-naphthyl]amino]benzoic acid 4-[[(4E)-1-oxo-4-(2,4,6-trimethylphenyl)sulfonylimino-2-naphthalenyl]amino]benzoic acid MLS000948031 cid_9609431
TypeSmall organic molecule
Emp. Form.C26H22N2O5S
Mol. Mass.474.528
SMILESCc1cc(C)c(c(C)c1)S(=O)(=O)N=C1C=C(Nc2ccc(cc2)C(O)=O)C(=O)c2ccccc12