Reaction Details
TargetMitochondrial peptide methionine sulfoxide reductase
LigandBDBM95458
Substrate/Competitorn/a
IC50 52791±n/a nM
Citation PubChem, PC Absorbance-based biochemical high throughput dose response assay to identify inhibitors of Methionine sulfoxide reductase A (MsrA) PubChem Bioassay(2013)[AID]
 
Mitochondrial peptide methionine sulfoxide reductase
Name:Mitochondrial peptide methionine sulfoxide reductase
Type:Enzyme Catalytic Domain
Mol. Mass.:25822.90
Organism:Bos taurus
Description:gi_73586699
Residue:233
BDBM95458
NameBDBM95458
Synonyms:3-methyl-5-nitro-N-phenyl-4-imidazolesulfonamide 3-methyl-5-nitro-N-phenylimidazole-4-sulfonamide SMR001526826 | cid_236064
TypeSmall organic molecule
Emp. Form.C10H10N4O4S
Mol. Mass.282.276
SMILESCn1cnc(c1S(=O)(=O)Nc1ccccc1)[N+]([O-])=O