Reaction Details
TargetMitochondrial peptide methionine sulfoxide reductase
LigandBDBM88680
Substrate/Competitorn/a
IC50 11016±n/a nM
Citation PubChem, PC Absorbance-based biochemical high throughput dose response assay to identify inhibitors of Methionine sulfoxide reductase A (MsrA) PubChem Bioassay(2013)[AID]
 
Mitochondrial peptide methionine sulfoxide reductase
Name:Mitochondrial peptide methionine sulfoxide reductase
Type:Enzyme Catalytic Domain
Mol. Mass.:25822.90
Organism:Bos taurus
Description:gi_73586699
Residue:233
BDBM88680
NameBDBM88680
Synonyms:1,2-bis(diethoxyphosphoryl)ethane;dichloro(diethyl)stannane SMR001566738 cid_371346
TypeSmall organic molecule
Emp. Form.C10H24O6P2
Mol. Mass.302.2415
SMILESCCOP(=O)(CCP(=O)(OCC)OCC)OCC