Reaction Details
TargetMitochondrial peptide methionine sulfoxide reductase
LigandBDBM95464
Substrate/Competitorn/a
IC50 4818±n/a nM
Citation PubChem, PC Absorbance-based biochemical high throughput dose response assay to identify inhibitors of Methionine sulfoxide reductase A (MsrA) PubChem Bioassay(2013)[AID]
 
Mitochondrial peptide methionine sulfoxide reductase
Name:Mitochondrial peptide methionine sulfoxide reductase
Type:Enzyme Catalytic Domain
Mol. Mass.:25822.90
Organism:Bos taurus
Description:gi_73586699
Residue:233
BDBM95464
NameBDBM95464
Synonyms:4-[[(4Z)-1-keto-4-(2-thienylsulfonylimino)-2-naphthyl]amino]benzoic acid 4-[[(4Z)-1-oxo-4-thiophen-2-ylsulfonylimino-2-naphthalenyl]amino]benzoic acid MLS000409192 cid_5894846
TypeSmall organic molecule
Emp. Form.C21H14N2O5S2
Mol. Mass.438.476
SMILESOC(=O)c1ccc(NC2=CC(=NS(=O)(=O)c3cccs3)c3ccccc3C2=O)cc1