Reaction Details
TargetNuclear receptor subfamily 5 group A member 2
LigandBDBM95679
Substrate/Competitorn/a
IC50>1328±n/a nM
Citation PubChem, PC Luminescence-based cell-based high throughput dose response assay for inverse agonists of the liver receptor homolog-1 (LRH-1; NR5A2) PubChem Bioassay(2013)[AID]
 
Nuclear receptor subfamily 5 group A member 2
Name:Nuclear receptor subfamily 5 group A member 2
Type:Nuclear Hormone Receptor
Mol. Mass.:61341.37
Organism:Homo sapiens (Human)
Description:n/a
Residue:541
BDBM95679
NameBDBM95679
Synonyms:1-benzyl-3,5-dimethyl-pyrazole-4-carboxylic acid [2-[2-(cyanomethylthio)anilino]-2-keto-ethyl] ester MLS000057192 [2-[2-(cyanomethylsulfanyl)anilino]-2-oxoethyl] 1-benzyl-3,5-dimethylpyrazole-4-carboxylate cid_2571013
TypeSmall organic molecule
Emp. Form.C23H22N4O3S
Mol. Mass.434.511
SMILESCc1nn(Cc2ccccc2)c(C)c1C(=O)OCC(=O)Nc1ccccc1SCC#N