Reaction Details
TargetNuclear receptor subfamily 5 group A member 2
LigandBDBM95485
Substrate/Competitorn/a
IC50 4177±n/a nM
Citation PubChem, PC Luminescence-based cell-based high throughput dose response assay for inverse agonists of the liver receptor homolog-1 (LRH-1; NR5A2) PubChem Bioassay(2013)[AID]
 
Nuclear receptor subfamily 5 group A member 2
Name:Nuclear receptor subfamily 5 group A member 2
Type:Nuclear Hormone Receptor
Mol. Mass.:61341.37
Organism:Homo sapiens (Human)
Description:n/a
Residue:541
BDBM95485
NameBDBM95485
Synonyms:3-[2-(4-ethoxyphenoxy)ethyl]-5-(1H-indol-3-ylmethyl)hydantoin MLS000564292 cid_4279549
TypeSmall organic molecule
Emp. Form.C22H23N3O4
Mol. Mass.393.4357
SMILESCCOc1ccc(OCCN2C(=O)NC(Cc3c[nH]c4ccccc34)C2=O)cc1