Reaction Details
TargetNuclear receptor subfamily 5 group A member 2
LigandBDBM68824
Substrate/Competitorn/a
IC50>11963±n/a nM
Citation PubChem, PC Luminescence-based cell-based high throughput dose response assay for inverse agonists of the liver receptor homolog-1 (LRH-1; NR5A2) PubChem Bioassay(2013)[AID]
 
Nuclear receptor subfamily 5 group A member 2
Name:Nuclear receptor subfamily 5 group A member 2
Type:Nuclear Hormone Receptor
Mol. Mass.:61341.37
Organism:Homo sapiens (Human)
Description:n/a
Residue:541
BDBM68824
NameBDBM68824
Synonyms:2-[2,5-bis(oxidanylidene)pyrrolidin-1-yl]-N-(4-bromanyl-2-methyl-phenyl)ethanamide N-(4-bromo-2-methyl-phenyl)-2-succinimido-acetamide N-(4-bromo-2-methylphenyl)-2-(2,5-dioxopyrrolidin-1-yl)acetamide cid_2523069
TypeSmall organic molecule
Emp. Form.C13H13BrN2O3
Mol. Mass.325.158
SMILESCc1cc(Br)ccc1NC(=O)CN1C(=O)CCC1=O