Reaction Details
TargetNuclear receptor subfamily 5 group A member 2
LigandBDBM95505
Substrate/Competitorn/a
IC50 2642±n/a nM
Citation PubChem, PC Luminescence-based cell-based high throughput dose response assay for inverse agonists of the liver receptor homolog-1 (LRH-1; NR5A2) PubChem Bioassay(2013)[AID]
 
Nuclear receptor subfamily 5 group A member 2
Name:Nuclear receptor subfamily 5 group A member 2
Type:Nuclear Hormone Receptor
Mol. Mass.:61341.37
Organism:Homo sapiens (Human)
Description:n/a
Residue:541
BDBM95505
NameBDBM95505
Synonyms:2-(1H-indol-3-yl)acetic acid [2-(4-acetamidoanilino)-2-keto-ethyl] ester MLS000388640 [2-(4-acetamidoanilino)-2-oxoethyl] 2-(1H-indol-3-yl)acetate cid_2466717
TypeSmall organic molecule
Emp. Form.C20H19N3O4
Mol. Mass.365.3826
SMILESCC(=O)Nc1ccc(NC(=O)COC(=O)Cc2c[nH]c3ccccc23)cc1