Reaction Details
TargetNuclear receptor subfamily 5 group A member 2
LigandBDBM65420
Substrate/Competitorn/a
IC50>35871±n/a nM
Citation PubChem, PC Luminescence-based cell-based high throughput dose response assay for inverse agonists of the liver receptor homolog-1 (LRH-1; NR5A2) PubChem Bioassay(2013)[AID]
 
Nuclear receptor subfamily 5 group A member 2
Name:Nuclear receptor subfamily 5 group A member 2
Type:Nuclear Hormone Receptor
Mol. Mass.:61341.37
Organism:Homo sapiens (Human)
Description:n/a
Residue:541
BDBM65420
NameBDBM65420
Synonyms:MLS000707959 N-[4-(furan-2-carbonylamino)-3-methylphenyl]-5-nitrofuran-2-carboxamide N-[4-[[2-furanyl(oxo)methyl]amino]-3-methylphenyl]-5-nitro-2-furancarboxamide cid_3143422
TypeSmall organic molecule
Emp. Form.C17H13N3O6
Mol. Mass.355.3016
SMILESCc1cc(NC(=O)c2ccc(o2)[N+]([O-])=O)ccc1NC(=O)c1ccco1