Reaction Details
TargetNuclear receptor subfamily 5 group A member 2
LigandBDBM65445
Substrate/Competitorn/a
IC50>35874±n/a nM
Citation PubChem, PC Luminescence-based cell-based high throughput dose response assay for inverse agonists of the liver receptor homolog-1 (LRH-1; NR5A2) PubChem Bioassay(2013)[AID]
 
Nuclear receptor subfamily 5 group A member 2
Name:Nuclear receptor subfamily 5 group A member 2
Type:Nuclear Hormone Receptor
Mol. Mass.:61341.37
Organism:Homo sapiens (Human)
Description:n/a
Residue:541
BDBM65445
NameBDBM65445
Synonyms:3-(2,3-dihydro-1,4-benzodioxin-6-ylamino)-6-(phenylmethyl)-2H-1,2,4-triazin-5-one 6-benzyl-3-(2,3-dihydro-1,4-benzodioxin-6-ylamino)-2H-1,2,4-triazin-5-one SMR000313799 | cid_2153943
TypeSmall organic molecule
Emp. Form.C18H16N4O3
Mol. Mass.336.3446
SMILESO=c1[nH]c(Nc2ccc3OCCOc3c2)nnc1Cc1ccccc1