Reaction Details
TargetNuclear receptor subfamily 5 group A member 2
LigandBDBM95575
Substrate/Competitorn/a
IC50 1868±n/a nM
Citation PubChem, PC Luminescence-based cell-based high throughput dose response assay for inverse agonists of the liver receptor homolog-1 (LRH-1; NR5A2) PubChem Bioassay(2013)[AID]
 
Nuclear receptor subfamily 5 group A member 2
Name:Nuclear receptor subfamily 5 group A member 2
Type:Nuclear Hormone Receptor
Mol. Mass.:61341.37
Organism:Homo sapiens (Human)
Description:n/a
Residue:541
BDBM95575
NameBDBM95575
Synonyms:4-[2-(3,5-dimethoxyphenyl)-3-furo[3,2-b]pyridinyl]-3-butyn-1-ol MLS001249972 cid_24793989
TypeSmall organic molecule
Emp. Form.C19H17NO4
Mol. Mass.323.3426
SMILESCOc1cc(OC)cc(c1)-c1oc2cccnc2c1C#CCCO