Reaction Details
TargetNuclear receptor subfamily 5 group A member 2
LigandBDBM95611
Substrate/Competitorn/a
IC50>3985±n/a nM
Citation PubChem, PC Luminescence-based cell-based high throughput dose response assay for inverse agonists of the liver receptor homolog-1 (LRH-1; NR5A2) PubChem Bioassay(2013)[AID]
 
Nuclear receptor subfamily 5 group A member 2
Name:Nuclear receptor subfamily 5 group A member 2
Type:Nuclear Hormone Receptor
Mol. Mass.:61341.37
Organism:Homo sapiens (Human)
Description:n/a
Residue:541
BDBM95611
NameBDBM95611
Synonyms:2-[(5-keto-2H-1,2,4-triazin-3-yl)thio]-N-(3-nitrophenyl)acetamide N-(3-nitrophenyl)-2-[(5-oxidanylidene-2H-1,2,4-triazin-3-yl)sulfanyl]ethanamide N-(3-nitrophenyl)-2-[(5-oxo-2H-1,2,4-triazin-3-yl)thio]acetamide cid_7151212
TypeSmall organic molecule
Emp. Form.C11H9N5O4S
Mol. Mass.307.285
SMILES[O-][N+](=O)c1cccc(NC(=O)CSc2[nH+]ncc(=O)[n-]2)c1