Reaction Details
TargetNuclear receptor subfamily 5 group A member 2
LigandBDBM95624
Substrate/Competitorn/a
IC50 3117±n/a nM
Citation PubChem, PC Luminescence-based cell-based high throughput dose response assay for inverse agonists of the liver receptor homolog-1 (LRH-1; NR5A2) PubChem Bioassay(2013)[AID]
 
Nuclear receptor subfamily 5 group A member 2
Name:Nuclear receptor subfamily 5 group A member 2
Type:Nuclear Hormone Receptor
Mol. Mass.:61341.37
Organism:Homo sapiens (Human)
Description:n/a
Residue:541
BDBM95624
NameBDBM95624
Synonyms:2,4-dihydroxybenzoic acid [2-[4-[2-(2,4-dihydroxybenzoyl)oxyacetyl]piperazino]-2-keto-ethyl] ester MLS001160749 [2-[4-[2-(2,4-dihydroxybenzoyl)oxyacetyl]piperazin-1-yl]-2-oxoethyl] 2,4-dihydroxybenzoate cid_24687847
TypeSmall organic molecule
Emp. Form.C22H22N2O10
Mol. Mass.474.4175
SMILESOc1ccc(C(=O)OCC(=O)N2CCN(CC2)C(=O)COC(=O)c2ccc(O)cc2O)c(O)c1