Reaction Details
TargetNuclear receptor subfamily 5 group A member 2
LigandBDBM95632
Substrate/Competitorn/a
IC50 168.81±n/a nM
Citation PubChem, PC Luminescence-based cell-based high throughput dose response assay for inverse agonists of the liver receptor homolog-1 (LRH-1; NR5A2) PubChem Bioassay(2013)[AID]
 
Nuclear receptor subfamily 5 group A member 2
Name:Nuclear receptor subfamily 5 group A member 2
Type:Nuclear Hormone Receptor
Mol. Mass.:61341.37
Organism:Homo sapiens (Human)
Description:n/a
Residue:541
BDBM95632
NameBDBM95632
Synonyms:2-[1,3-bis(oxidanylidene)-3a,4,7,7a-tetrahydroisoindol-2-yl]-N-(4-bromanyl-2-methyl-phenyl)ethanamide N-(4-bromo-2-methyl-phenyl)-2-(1,3-diketo-3a,4,7,7a-tetrahydroisoindol-2-yl)acetamide SMR001245748 | cid_4789729
TypeSmall organic molecule
Emp. Form.C17H17BrN2O3
Mol. Mass.377.232
SMILESCc1cc(Br)ccc1NC(=O)CN1C(=O)C2CC=CCC2C1=O