Reaction Details
TargetNuclear receptor subfamily 5 group A member 2
LigandBDBM95646
Substrate/Competitorn/a
IC50>3985±n/a nM
Citation PubChem, PC Luminescence-based cell-based high throughput dose response assay for inverse agonists of the liver receptor homolog-1 (LRH-1; NR5A2) PubChem Bioassay(2013)[AID]
 
Nuclear receptor subfamily 5 group A member 2
Name:Nuclear receptor subfamily 5 group A member 2
Type:Nuclear Hormone Receptor
Mol. Mass.:61341.37
Organism:Homo sapiens (Human)
Description:n/a
Residue:541
BDBM95646
NameBDBM95646
Synonyms:4-ketochromene-2-carboxylic acid [2-(2-bromo-4-methyl-anilino)-2-keto-ethyl] ester MLS002247997 [2-(2-bromo-4-methylanilino)-2-oxoethyl] 4-oxochromene-2-carboxylate cid_2369164
TypeSmall organic molecule
Emp. Form.C19H14BrNO5
Mol. Mass.416.222
SMILESCc1ccc(NC(=O)COC(=O)c2cc(=O)c3ccccc3o2)c(Br)c1