Reaction Details
TargetNuclear receptor subfamily 5 group A member 2
LigandBDBM95664
Substrate/Competitorn/a
IC50>1329±n/a nM
Citation PubChem, PC Luminescence-based cell-based high throughput dose response assay for inverse agonists of the liver receptor homolog-1 (LRH-1; NR5A2) PubChem Bioassay(2013)[AID]
 
Nuclear receptor subfamily 5 group A member 2
Name:Nuclear receptor subfamily 5 group A member 2
Type:Nuclear Hormone Receptor
Mol. Mass.:61341.37
Organism:Homo sapiens (Human)
Description:n/a
Residue:541
BDBM95664
NameBDBM95664
Synonyms:(2R)-2-[(4S,5R)-8-(2-fluorophenyl)-1,1-diketo-4-methyl-5-[[methyl(4-pyridylmethyl)amino]methyl]-4,5-dihydro-3H-6,,2-benzoxathiazocin-2-yl]propan-1-ol (2R)-2-[(4S,5R)-8-(2-fluorophenyl)-4-methyl-5-[[methyl(pyridin-4-ylmethyl)amino]methyl]-1,1-dioxo-4,5-dihydro-3H-6,,2-benzoxathiazocin-2-yl]-1-propanol MLS003130145 cid_46903543
TypeSmall organic molecule
Emp. Form.C27H32FN3O4S
Mol. Mass.513.624
SMILESC[C@H](CO)N1C[C@H](C)[C@H](CN(C)Cc2ccncc2)Oc2cc(ccc2S1(=O)=O)-c1ccccc1F