Reaction Details
TargetMethionine--tRNA ligase
LigandBDBM95691
Substrate/Competitorn/a
IC50 1851±n/a nM
Citation PubChem, PC Luminescence-based biochemical high throughput dose response assay for inhibitors of Trypanosoma brucei methionyl tRNA synthetase (MetRS) PubChem Bioassay(2013)[AID]
 
Methionine--tRNA ligase
Name:Methionine--tRNA ligase
Synonyms:methionyl-tRNA synthetase
Type:Enzyme Catalytic Domain
Mol. Mass.:86905.45
Organism:Trypanosoma brucei brucei strain 927/4 GUTat10.1
Description:gi_71746704
Residue:773
BDBM95691
NameBDBM95691
TypeSmall organic molecule
Emp. Form.C13H12BrClN2O3S2
Mol. Mass.423.733
SMILESClc1ccc(NC(=O)CCNS(=O)(=O)c2ccc(Br)s2)cc1