Reaction Details
TargetMethionine--tRNA ligase
LigandBDBM57346
Substrate/Competitorn/a
IC50 1279±n/a nM
Citation PubChem, PC Luminescence-based biochemical high throughput dose response assay for inhibitors of Trypanosoma brucei methionyl tRNA synthetase (MetRS) PubChem Bioassay(2013)[AID]
 
Methionine--tRNA ligase
Name:Methionine--tRNA ligase
Synonyms:methionyl-tRNA synthetase
Type:Enzyme Catalytic Domain
Mol. Mass.:86905.45
Organism:Trypanosoma brucei brucei strain 927/4 GUTat10.1
Description:gi_71746704
Residue:773
BDBM57346
NameBDBM57346
TypeSmall organic molecule
Emp. Form.C23H16Cl2N4O2
Mol. Mass.451.305
SMILESClc1ccc(c(Cl)c1)-c1cc(C(=O)NNC(=O)Nc2ccccc2)c2ccccc2n1