Reaction Details
TargetMethionine--tRNA ligase
LigandBDBM72157
Substrate/Competitorn/a
IC50 170.37±n/a nM
Citation PubChem, PC Luminescence-based biochemical high throughput dose response assay for inhibitors of Trypanosoma brucei methionyl tRNA synthetase (MetRS) PubChem Bioassay(2013)[AID]
 
Methionine--tRNA ligase
Name:Methionine--tRNA ligase
Synonyms:methionyl-tRNA synthetase
Type:Enzyme Catalytic Domain
Mol. Mass.:86905.45
Organism:Trypanosoma brucei brucei strain 927/4 GUTat10.1
Description:gi_71746704
Residue:773
BDBM72157
NameBDBM72157
TypeSmall organic molecule
Emp. Form.C16H13ClN4O3
Mol. Mass.344.752
SMILES[O-][N+](=O)c1cc(ccc1Cl)C(=O)NCCc1nc2ccccc2[nH]1