Reaction Details
TargetMethionine--tRNA ligase
LigandBDBM95748
Substrate/Competitorn/a
IC50 1731±n/a nM
Citation PubChem, PC Luminescence-based biochemical high throughput dose response assay for inhibitors of Trypanosoma brucei methionyl tRNA synthetase (MetRS) PubChem Bioassay(2013)[AID]
 
Methionine--tRNA ligase
Name:Methionine--tRNA ligase
Synonyms:methionyl-tRNA synthetase
Type:Enzyme Catalytic Domain
Mol. Mass.:86905.45
Organism:Trypanosoma brucei brucei strain 927/4 GUTat10.1
Description:gi_71746704
Residue:773
BDBM95748
NameBDBM95748
TypeSmall organic molecule
Emp. Form.C16H14ClN3O4
Mol. Mass.347.753
SMILES[O-][N+](=O)c1ccc(CO[N-][CH+]CC(=O)Nc2ccc(Cl)cc2)cc1