Reaction Details
TargetMethionine--tRNA ligase
LigandBDBM95765
Substrate/Competitorn/a
IC50 498.14±n/a nM
Citation PubChem, PC Luminescence-based biochemical high throughput dose response assay for inhibitors of Trypanosoma brucei methionyl tRNA synthetase (MetRS) PubChem Bioassay(2013)[AID]
 
Methionine--tRNA ligase
Name:Methionine--tRNA ligase
Synonyms:methionyl-tRNA synthetase
Type:Enzyme Catalytic Domain
Mol. Mass.:86905.45
Organism:Trypanosoma brucei brucei strain 927/4 GUTat10.1
Description:gi_71746704
Residue:773
BDBM95765
NameBDBM95765
TypeSmall organic molecule
Emp. Form.C28H26BrN3O4
Mol. Mass.548.428
SMILESOCc1ccc(CO[C@@H]2C[C@@H](C=C(O2)C(=O)NCc2nc3ccccc3[nH]2)c2ccc(Br)cc2)cc1