Reaction Details
TargetMethionine--tRNA ligase
LigandBDBM95766
Substrate/Competitorn/a
IC50 1837±n/a nM
Citation PubChem, PC Luminescence-based biochemical high throughput dose response assay for inhibitors of Trypanosoma brucei methionyl tRNA synthetase (MetRS) PubChem Bioassay(2013)[AID]
 
Methionine--tRNA ligase
Name:Methionine--tRNA ligase
Synonyms:methionyl-tRNA synthetase
Type:Enzyme Catalytic Domain
Mol. Mass.:86905.45
Organism:Trypanosoma brucei brucei strain 927/4 GUTat10.1
Description:gi_71746704
Residue:773
BDBM95766
NameBDBM95766
TypeSmall organic molecule
Emp. Form.C25H27N3O6
Mol. Mass.465.4984
SMILESOCCCCO[C@H]1C[C@H](C=C(O1)C(=O)NCc1nc2ccccc2[nH]1)c1ccc2OCOc2c1