Reaction Details
TargetMethionine--tRNA ligase
LigandBDBM95798
Substrate/Competitorn/a
IC50 527.84±n/a nM
Citation PubChem, PC Luminescence-based biochemical high throughput dose response assay for inhibitors of Trypanosoma brucei methionyl tRNA synthetase (MetRS) PubChem Bioassay(2013)[AID]
 
Methionine--tRNA ligase
Name:Methionine--tRNA ligase
Synonyms:methionyl-tRNA synthetase
Type:Enzyme Catalytic Domain
Mol. Mass.:86905.45
Organism:Trypanosoma brucei brucei strain 927/4 GUTat10.1
Description:gi_71746704
Residue:773
BDBM95798
NameBDBM95798
TypeSmall organic molecule
Emp. Form.C23H22N4O5
Mol. Mass.434.4446
SMILESOCCCN1CC(=O)N2[C@@H](Cc3c([nH]c4ccccc34)C2c2cccc(c2)[N+]([O-])=O)C1=O