Reaction Details
TargetMethionine--tRNA ligase
LigandBDBM95811
Substrate/Competitorn/a
IC50 755.59±n/a nM
Citation PubChem, PC Luminescence-based biochemical high throughput dose response assay for inhibitors of Trypanosoma brucei methionyl tRNA synthetase (MetRS) PubChem Bioassay(2013)[AID]
 
Methionine--tRNA ligase
Name:Methionine--tRNA ligase
Synonyms:methionyl-tRNA synthetase
Type:Enzyme Catalytic Domain
Mol. Mass.:86905.45
Organism:Trypanosoma brucei brucei strain 927/4 GUTat10.1
Description:gi_71746704
Residue:773
BDBM95811
NameBDBM95811
TypeSmall organic molecule
Emp. Form.C17H16BrN3O4
Mol. Mass.406.231
SMILESCC(CC(=O)Nc1cccc(Br)c1)=NNC(=O)c1ccc(O)cc1O