Reaction Details
TargetLow molecular weight phosphotyrosine protein phosphatase
LigandBDBM35730
Substrate/Competitorn/a
IC50>80000±n/a nM
Citation PubChem, PC Dose response confirmation of small molecule inhibitors of Low Molecular Weight Protein Tyrosine Phosphatase, LMPTP, in an orthogonal absorbance-based assay PubChem Bioassay(2013)[AID]
 
Low molecular weight phosphotyrosine protein phosphatase
Name:Low molecular weight phosphotyrosine protein phosphatase
Type:n/a
Mol. Mass.:18042.81
Organism:Homo sapiens (Human)
Description:P24666
Residue:158
BDBM35730
NameBDBM35730
Synonyms:cid_694792 | sulfonamide deriv., 5e
TypeSmall organic molecule
Emp. Form.C13H14N2O3S2
Mol. Mass.310.392
SMILESNS(=O)(=O)c1ccc(CNC(=O)Cc2cccs2)cc1