Reaction Details
TargetLow molecular weight phosphotyrosine protein phosphatase
LigandBDBM66141
Substrate/Competitorn/a
IC50 3720±n/a nM
Citation PubChem, PC Dose response confirmation of small molecule inhibitors of Low Molecular Weight Protein Tyrosine Phosphatase, LMPTP, in an orthogonal absorbance-based assay PubChem Bioassay(2013)[AID]
 
Low molecular weight phosphotyrosine protein phosphatase
Name:Low molecular weight phosphotyrosine protein phosphatase
Type:n/a
Mol. Mass.:18042.81
Organism:Homo sapiens (Human)
Description:P24666
Residue:158
BDBM66141
NameBDBM66141
Synonyms:5-Nitro-furan-2-carboxylic acid [2-(2-fluoro-phenyl)-benzooxazol-5-yl]-amide N-[2-(2-fluorophenyl)-1,3-benzoxazol-5-yl]-5-nitro-2-furamide N-[2-(2-fluorophenyl)-1,3-benzoxazol-5-yl]-5-nitro-furan-2-carboxamide SMR000554884 | cid_3116398
TypeSmall organic molecule
Emp. Form.C18H10FN3O5
Mol. Mass.367.2875
SMILES[O-][N+](=O)c1ccc(o1)C(=O)Nc1ccc2oc(nc2c1)-c1ccccc1F