Reaction Details
TargetLow molecular weight phosphotyrosine protein phosphatase
LigandBDBM46213
Substrate/Competitorn/a
IC50 52800±n/a nM
Citation PubChem, PC Dose response confirmation of small molecule inhibitors of Low Molecular Weight Protein Tyrosine Phosphatase, LMPTP, in an orthogonal absorbance-based assay PubChem Bioassay(2013)[AID]
 
Low molecular weight phosphotyrosine protein phosphatase
Name:Low molecular weight phosphotyrosine protein phosphatase
Type:n/a
Mol. Mass.:18042.81
Organism:Homo sapiens (Human)
Description:P24666
Residue:158
BDBM46213
NameBDBM46213
Synonyms:2-[4-[[6-carbethoxy-3-keto-7-methyl-5-[4-(methylthio)phenyl]-5H-thiazolo[3,2-a]pyrimidin-2-ylidene]methyl]phenoxy]acetic acid 2-[4-[[6-ethoxycarbonyl-7-methyl-5-(4-methylsulfanylphenyl)-3-oxo-5H-[1,3]thiazolo[3,2-a]pyrimidin-2-ylidene]methyl]phenoxy]acetic acid ML120 cid_4302116
TypeSmall organic molecule
Emp. Form.C26H24N2O6S2
Mol. Mass.524.609
SMILESCCOC(=O)C1=C(C)N=c2sc(=Cc3ccc(OCC(O)=O)cc3)c(=O)n2C1c1ccc(SC)cc1